{"text_format":"2","workbook":"xlsx","n_sheets":9,"sheets":["Gruppe A","Gruppe B","Gruppe C","Gruppe D","Zwi.runde I","Zwi.runde II","Finals","Endstand","Modus"],"not_rendered":{"charts":0,"images":4,"macros":1,"external_links":0,"defined_names":0,"comments":1,"pivot_tables":0},"unopened":[],"bounds":{"document_bytes":16777216,"sheet_cells":100000,"run_cost":"one","rows_first":2000,"rows_last":500,"rows_between":2000,"halvings":0,"cell_chars":16384,"cell_head_chars":4096},"cells_cut":0,"cells_raw":0,"read":"whole","date_system":"1900"}

{"sheet":"Gruppe A","index":0,"n_rows":21,"n_cols":9,"rows_kept":21,"cut":false,"hidden":false,"merged":[[6,0,6,8],[15,0,15,6],[4,0,4,1],[0,0,0,1],[1,0,1,1],[2,0,2,1],[3,0,3,1]]}
["Mannschaften Gruppe A"]
["Erster A"]
["Zweiter A"]
["Dritter A"]
["Vierter A"]
[]
["Spielplan Vorrunde"]
["Mannschaft 1","Mannschaft 2","Schiedsrichter","Bälle M1","Bälle M2","Punkte M1","Punkte M2","Zeit","Halle/Feld"]
[{"$f":"$A$2","v":"Erster A"},{"$f":"$A$3","v":"Zweiter A"},{"$f":"$A$5","v":"Vierter A"},0,0,{"$f":"IF(D9>E9,2,IF(D9=E9,1,0))","v":1},{"$f":"IF(D9<E9,2,IF(D9=E9,1,0))","v":1},"09:30:00"]
[{"$f":"$A$4","v":"Dritter A"},{"$f":"$A$5","v":"Vierter A"},{"$f":"$A$3","v":"Zweiter A"},0,0,1,1,"10:00:00"]
[{"$f":"$A$2","v":"Erster A"},{"$f":"$A$5","v":"Vierter A"},{"$f":"$A$4","v":"Dritter A"},0,0,1,1,"10:30:00"]
[{"$f":"$A$3","v":"Zweiter A"},{"$f":"$A$4","v":"Dritter A"},{"$f":"$A$2","v":"Erster A"},0,0,1,1,"11:00:00"]
[{"$f":"$A$3","v":"Zweiter A"},{"$f":"$A$5","v":"Vierter A"},{"$f":"$A$4","v":"Dritter A"},0,0,1,1,"11:30:00"]
[{"$f":"$A$2","v":"Erster A"},{"$f":"$A$4","v":"Dritter A"},{"$f":"$A$3","v":"Zweiter A"},0,0,1,1,"12:00:00"]
[]
["Tabelle"]
["Team","Punkte +","Punkte -","Punktequotient","Bälle +","Bälle -","Ballquotient"]
[{"$f":"$A$2","v":"Erster A"},{"$f":"$F$9+$F$14+$F$11","v":3},{"$f":"$G$9+$G$11+$G$14","v":3},{"$f":"IF(C18=0,6,B18/C18)","v":1},{"$f":"$D$9+$D$14+$D$11","v":0},{"$f":"$E$9+$E$11+$E$14","v":0},{"$f":"IF(F18=0,100,E18/F18)","v":100}]
[{"$f":"$A$3","v":"Zweiter A"},{"$f":"$G$9+$F$13+$F$12","v":3},{"$f":"$F$9+$G$12+$G$13","v":3},{"$f":"IF(C19=0,6,B19/C19)","v":1},{"$f":"$E$9+$D$13+$D$12","v":0},{"$f":"$D$9+$E$12+$E$13","v":0},{"$f":"IF(F19=0,100,E19/F19)","v":100}]
[{"$f":"$A$4","v":"Dritter A"},{"$f":"$F$10+$G$14+$G$12","v":3},{"$f":"$G$10+$F$12+$F$14","v":3},{"$f":"IF(C20=0,6,B20/C20)","v":1},{"$f":"$D$10+$E$14+$E$12","v":0},{"$f":"$E$10+$D$12+$D$14","v":0},{"$f":"IF(F20=0,100,E20/F20)","v":100}]
[{"$f":"$A$5","v":"Vierter A"},{"$f":"$G$10+$G$13+$G$11","v":3},{"$f":"$F$10+$F$11+$F$13","v":3},{"$f":"IF(C21=0,6,B21/C21)","v":1},{"$f":"$E$10+$E$13+$E$11","v":0},{"$f":"$D$10+$D$11+$D$13","v":0},{"$f":"IF(F21=0,100,E21/F21)","v":100}]

{"sheet":"Gruppe B","index":1,"n_rows":21,"n_cols":9,"rows_kept":21,"cut":false,"hidden":false,"merged":[[6,0,6,8],[15,0,15,6],[4,0,4,1],[0,0,0,1],[1,0,1,1],[2,0,2,1],[3,0,3,1]]}
["Mannschaften Gruppe B"]
["Erster B"]
["Zweiter B"]
["Dritter B"]
["Vierter B"]
[]
["Spielplan Vorrunde"]
["Mannschaft 1","Mannschaft 2","Schiedsrichter","Bälle M1","Bälle M2","Punkte M1","Punkte M2","Zeit","Halle/Feld"]
[{"$f":"$A$2","v":"Erster B"},{"$f":"$A$3","v":"Zweiter B"},{"$f":"$A$5","v":"Vierter B"},0,0,{"$f":"IF(D9>E9,2,IF(D9=E9,1,0))","v":1},{"$f":"IF(D9<E9,2,IF(D9=E9,1,0))","v":1},"09:30:00"]
[{"$f":"$A$4","v":"Dritter B"},{"$f":"$A$5","v":"Vierter B"},{"$f":"$A$3","v":"Zweiter B"},0,0,1,1,"10:00:00"]
[{"$f":"$A$2","v":"Erster B"},{"$f":"$A$5","v":"Vierter B"},{"$f":"$A$4","v":"Dritter B"},0,0,1,1,"10:30:00"]
[{"$f":"$A$3","v":"Zweiter B"},{"$f":"$A$4","v":"Dritter B"},{"$f":"$A$2","v":"Erster B"},0,0,1,1,"11:00:00"]
[{"$f":"$A$3","v":"Zweiter B"},{"$f":"$A$5","v":"Vierter B"},{"$f":"$A$4","v":"Dritter B"},0,0,1,1,"11:30:00"]
[{"$f":"$A$2","v":"Erster B"},{"$f":"$A$4","v":"Dritter B"},{"$f":"$A$3","v":"Zweiter B"},0,0,1,1,"12:00:00"]
[]
["Tabelle"]
["Team","Punkte +","Punkte -","Punktequotient","Bälle +","Bälle -","Ballquotient"]
[{"$f":"$A$2","v":"Erster B"},{"$f":"$F$9+$F$14+$F$11","v":3},{"$f":"$G$9+$G$11+$G$14","v":3},{"$f":"IF(C18=0,6,B18/C18)","v":1},{"$f":"$D$9+$D$14+$D$11","v":0},{"$f":"$E$9+$E$11+$E$14","v":0},{"$f":"IF(F18=0,100,E18/F18)","v":100}]
[{"$f":"$A$3","v":"Zweiter B"},{"$f":"$G$9+$F$13+$F$12","v":3},{"$f":"$F$9+$G$12+$G$13","v":3},{"$f":"IF(C19=0,6,B19/C19)","v":1},{"$f":"$E$9+$D$13+$D$12","v":0},{"$f":"$D$9+$E$12+$E$13","v":0},{"$f":"IF(F19=0,100,E19/F19)","v":100}]
[{"$f":"$A$4","v":"Dritter B"},{"$f":"$F$10+$G$14+$G$12","v":3},{"$f":"$G$10+$F$12+$F$14","v":3},{"$f":"IF(C20=0,6,B20/C20)","v":1},{"$f":"$D$10+$E$14+$E$12","v":0},{"$f":"$E$10+$D$12+$D$14","v":0},{"$f":"IF(F20=0,100,E20/F20)","v":100}]
[{"$f":"$A$5","v":"Vierter B"},{"$f":"$G$10+$G$13+$G$11","v":3},{"$f":"$F$10+$F$11+$F$13","v":3},{"$f":"IF(C21=0,6,B21/C21)","v":1},{"$f":"$E$10+$E$13+$E$11","v":0},{"$f":"$D$10+$D$11+$D$13","v":0},{"$f":"IF(F21=0,100,E21/F21)","v":100}]

{"sheet":"Gruppe C","index":2,"n_rows":21,"n_cols":9,"rows_kept":21,"cut":false,"hidden":false,"merged":[[6,0,6,8],[15,0,15,6],[4,0,4,1],[0,0,0,1],[1,0,1,1],[2,0,2,1],[3,0,3,1]]}
["Mannschaften Gruppe C"]
["Erster C"]
["Zweiter C"]
["Dritter C"]
["Vierter C"]
[]
["Spielplan Vorrunde"]
["Mannschaft 1","Mannschaft 2","Schiedsrichter","Bälle M1","Bälle M2","Punkte M1","Punkte M2","Zeit","Halle/Feld"]
[{"$f":"$A$2","v":"Erster C"},{"$f":"$A$3","v":"Zweiter C"},{"$f":"$A$5","v":"Vierter C"},0,0,{"$f":"IF(D9>E9,2,IF(D9=E9,1,0))","v":1},{"$f":"IF(D9<E9,2,IF(D9=E9,1,0))","v":1},"09:30:00"]
[{"$f":"$A$4","v":"Dritter C"},{"$f":"$A$5","v":"Vierter C"},{"$f":"$A$3","v":"Zweiter C"},0,0,1,1,"10:00:00"]
[{"$f":"$A$2","v":"Erster C"},{"$f":"$A$5","v":"Vierter C"},{"$f":"$A$4","v":"Dritter C"},0,0,1,1,"10:30:00"]
[{"$f":"$A$3","v":"Zweiter C"},{"$f":"$A$4","v":"Dritter C"},{"$f":"$A$2","v":"Erster C"},0,0,1,1,"11:00:00"]
[{"$f":"$A$3","v":"Zweiter C"},{"$f":"$A$5","v":"Vierter C"},{"$f":"$A$4","v":"Dritter C"},0,0,1,1,"11:30:00"]
[{"$f":"$A$2","v":"Erster C"},{"$f":"$A$4","v":"Dritter C"},{"$f":"$A$3","v":"Zweiter C"},0,0,1,1,"12:00:00"]
[]
["Tabelle"]
["Team","Punkte +","Punkte -","Punktequotient","Bälle +","Bälle -","Ballquotient"]
[{"$f":"$A$2","v":"Erster C"},{"$f":"$F$9+$F$14+$F$11","v":3},{"$f":"$G$9+$G$11+$G$14","v":3},{"$f":"IF(C18=0,6,B18/C18)","v":1},{"$f":"$D$9+$D$14+$D$11","v":0},{"$f":"$E$9+$E$11+$E$14","v":0},{"$f":"IF(F18=0,100,E18/F18)","v":100}]
[{"$f":"$A$3","v":"Zweiter C"},{"$f":"$G$9+$F$13+$F$12","v":3},{"$f":"$F$9+$G$12+$G$13","v":3},{"$f":"IF(C19=0,6,B19/C19)","v":1},{"$f":"$E$9+$D$13+$D$12","v":0},{"$f":"$D$9+$E$12+$E$13","v":0},{"$f":"IF(F19=0,100,E19/F19)","v":100}]
[{"$f":"$A$4","v":"Dritter C"},{"$f":"$F$10+$G$14+$G$12","v":3},{"$f":"$G$10+$F$12+$F$14","v":3},{"$f":"IF(C20=0,6,B20/C20)","v":1},{"$f":"$D$10+$E$14+$E$12","v":0},{"$f":"$E$10+$D$12+$D$14","v":0},{"$f":"IF(F20=0,100,E20/F20)","v":100}]
[{"$f":"$A$5","v":"Vierter C"},{"$f":"$G$10+$G$13+$G$11","v":3},{"$f":"$F$10+$F$11+$F$13","v":3},{"$f":"IF(C21=0,6,B21/C21)","v":1},{"$f":"$E$10+$E$13+$E$11","v":0},{"$f":"$D$10+$D$11+$D$13","v":0},{"$f":"IF(F21=0,100,E21/F21)","v":100}]

{"sheet":"Gruppe D","index":3,"n_rows":21,"n_cols":9,"rows_kept":21,"cut":false,"hidden":false,"merged":[[6,0,6,8],[15,0,15,6],[4,0,4,1],[0,0,0,1],[1,0,1,1],[2,0,2,1],[3,0,3,1]]}
["Mannschaften Gruppe D"]
["Erster D"]
["Zweiter D"]
["Dritter D"]
["Vierter D"]
[]
["Spielplan Vorrunde"]
["Mannschaft 1","Mannschaft 2","Schiedsrichter","Bälle M1","Bälle M2","Punkte M1","Punkte M2","Zeit","Halle/Feld"]
[{"$f":"$A$2","v":"Erster D"},{"$f":"$A$3","v":"Zweiter D"},{"$f":"$A$5","v":"Vierter D"},0,0,{"$f":"IF(D9>E9,2,IF(D9=E9,1,0))","v":1},{"$f":"IF(D9<E9,2,IF(D9=E9,1,0))","v":1},"09:30:00"]
[{"$f":"$A$4","v":"Dritter D"},{"$f":"$A$5","v":"Vierter D"},{"$f":"$A$3","v":"Zweiter D"},0,0,1,1,"10:00:00"]
[{"$f":"$A$2","v":"Erster D"},{"$f":"$A$5","v":"Vierter D"},{"$f":"$A$4","v":"Dritter D"},0,0,1,1,"10:30:00"]
[{"$f":"$A$3","v":"Zweiter D"},{"$f":"$A$4","v":"Dritter D"},{"$f":"$A$2","v":"Erster D"},0,0,1,1,"11:00:00"]
[{"$f":"$A$3","v":"Zweiter D"},{"$f":"$A$5","v":"Vierter D"},{"$f":"$A$4","v":"Dritter D"},0,0,1,1,"11:30:00"]
[{"$f":"$A$2","v":"Erster D"},{"$f":"$A$4","v":"Dritter D"},{"$f":"$A$3","v":"Zweiter D"},0,0,1,1,"12:00:00"]
[]
["Tabelle"]
["Team","Punkte +","Punkte -","Punktequotient","Bälle +","Bälle -","Ballquotient"]
[{"$f":"$A$2","v":"Erster D"},{"$f":"$F$9+$F$14+$F$11","v":3},{"$f":"$G$9+$G$11+$G$14","v":3},{"$f":"IF(C18=0,6,B18/C18)","v":1},{"$f":"$D$9+$D$14+$D$11","v":0},{"$f":"$E$9+$E$11+$E$14","v":0},{"$f":"IF(F18=0,100,E18/F18)","v":100}]
[{"$f":"$A$3","v":"Zweiter D"},{"$f":"$G$9+$F$13+$F$12","v":3},{"$f":"$F$9+$G$12+$G$13","v":3},{"$f":"IF(C19=0,6,B19/C19)","v":1},{"$f":"$E$9+$D$13+$D$12","v":0},{"$f":"$D$9+$E$12+$E$13","v":0},{"$f":"IF(F19=0,100,E19/F19)","v":100}]
[{"$f":"$A$4","v":"Dritter D"},{"$f":"$F$10+$G$14+$G$12","v":3},{"$f":"$G$10+$F$12+$F$14","v":3},{"$f":"IF(C20=0,6,B20/C20)","v":1},{"$f":"$D$10+$E$14+$E$12","v":0},{"$f":"$E$10+$D$12+$D$14","v":0},{"$f":"IF(F20=0,100,E20/F20)","v":100}]
[{"$f":"$A$5","v":"Vierter D"},{"$f":"$G$10+$G$13+$G$11","v":3},{"$f":"$F$10+$F$11+$F$13","v":3},{"$f":"IF(C21=0,6,B21/C21)","v":1},{"$f":"$E$10+$E$13+$E$11","v":0},{"$f":"$D$10+$D$11+$D$13","v":0},{"$f":"IF(F21=0,100,E21/F21)","v":100}]

{"sheet":"Zwi.runde I","index":4,"n_rows":21,"n_cols":10,"rows_kept":21,"cut":false,"hidden":false,"merged":[[0,0,0,9],[11,0,11,9]]}
["Überkreuz der Gruppenersten und Gruppenzweiten"]
["Spiel","Mannschaft 1","Mannschaft 2","Schiedsrichter","Bälle M1","Bälle M2","Punkte M1","Punkte M2","Zeit","Halle/Feld"]
[null,"Erster Gruppe A","Zweiter GruppeB","Erster Gruppe D"]
[1,{"$f":"'Gruppe A'!A18","v":"Erster A"},{"$f":"'Gruppe B'!A19","v":"Zweiter B"},{"$f":"'Gruppe D'!A18","v":"Erster D"},1,0,{"$f":"IF(E4>F4,2,IF(E4=F4,1,0))","v":2},{"$f":"IF(E4<F4,2,IF(E4=F4,1,0))","v":0},"13:00:00","A/1"]
[null,"Erster Gruppe B","Zweiter Gruppe A","Erster Gruppe C"]
[2,{"$f":"'Gruppe B'!A18","v":"Erster B"},{"$f":"'Gruppe A'!A19","v":"Zweiter A"},{"$f":"'Gruppe C'!$A$18","v":"Erster C"},1,0,{"$f":"IF(E6>F6,2,IF(E6=F6,1,0))","v":2},{"$f":"IF(E6<F6,2,IF(E6=F6,1,0))","v":0},"13:00:00","A/2"]
[null,"Erster Gruppe C","Zweiter Gruppe D","Erster Gruppe B"]
[3,{"$f":"'Gruppe C'!A18","v":"Erster C"},{"$f":"'Gruppe D'!A19","v":"Zweiter D"},{"$f":"'Gruppe B'!$A$18","v":"Erster B"},1,0,{"$f":"IF(E8>F8,2,IF(E8=F8,1,0))","v":2},{"$f":"IF(E8<F8,2,IF(E8=F8,1,0))","v":0},"13:30:00","A/1"]
[null,"Erster Gruppe D","Zweiter Gruppe C","Erster Gruppe A"]
[4,{"$f":"'Gruppe D'!A18","v":"Erster D"},{"$f":"'Gruppe C'!A19","v":"Zweiter C"},{"$f":"'Gruppe A'!$A$18","v":"Erster A"},1,0,{"$f":"IF(E10>F10,2,IF(E10=F10,1,0))","v":2},{"$f":"IF(E10<F10,2,IF(E10=F10,1,0))","v":0},"13:30:00","A/2"]
[]
["Überkreuz der Gruppendritten und Gruppenvierten"]
["Spiel","Mannschaft 1","Mannschaft 2","Schiedsrichter","Bälle M1","Bälle M2","Punkte M1","Punkte M2","Zeit","Halle/Feld"]
[null,"Dritter Gruppe A","Vierter GruppeB","Dritter Gruppe D"]
[5,{"$f":"'Gruppe A'!$A$20","v":"Dritter A"},{"$f":"'Gruppe B'!$A$21","v":"Vierter B"},{"$f":"'Gruppe D'!A20","v":"Dritter D"},1,0,{"$f":"IF(E15>F15,2,IF(E15=F15,1,0))","v":2},{"$f":"IF(E15<F15,2,IF(E15=F15,1,0))","v":0},"13:00:00","B/1"]
[null,"Dritter Gruppe B","Vierter Gruppe A","Dritter Gruppe C"]
[6,{"$f":"'Gruppe B'!$A$20","v":"Dritter B"},{"$f":"'Gruppe A'!A21","v":"Vierter A"},{"$f":"'Gruppe C'!$A$20","v":"Dritter C"},1,0,{"$f":"IF(E17>F17,2,IF(E17=F17,1,0))","v":2},{"$f":"IF(E17<F17,2,IF(E17=F17,1,0))","v":0},"13:00:00","B/2"]
[null,"Dritter Gruppe C","Vierter Gruppe D","Dritter Gruppe B"]
[7,{"$f":"'Gruppe C'!$A$20","v":"Dritter C"},{"$f":"'Gruppe D'!A21","v":"Vierter D"},{"$f":"'Gruppe B'!$A$20","v":"Dritter B"},1,0,{"$f":"IF(E19>F19,2,IF(E19=F19,1,0))","v":2},{"$f":"IF(E19<F19,2,IF(E19=F19,1,0))","v":0},"13:30:00","B/1"]
[null,"Dritter Gruppe D","Vierter Gruppe C","Dritter Gruppe A"]
[8,{"$f":"'Gruppe D'!A20","v":"Dritter D"},{"$f":"'Gruppe C'!A21","v":"Vierter C"},{"$f":"'Gruppe A'!$A$20","v":"Dritter A"},1,0,{"$f":"IF(E21>F21,2,IF(E21=F21,1,0))","v":2},{"$f":"IF(E21<F21,2,IF(E21=F21,1,0))","v":0},"13:30:00","B/2"]

{"sheet":"Zwi.runde II","index":5,"n_rows":27,"n_cols":10,"rows_kept":27,"cut":false,"hidden":false,"merged":[[21,0,21,9],[14,0,14,9],[7,0,7,9],[0,0,0,9]]}
["Sieger Überkreuz der Gruppenersten und Gruppenzweiten"]
["Spiel","Mannschaft 1","Mannschaft 2","Schiedsrichter","Bälle M1","Bälle M2","Punkte M1","Punkte M2","Zeit","Halle/Feld"]
[null,"Sieger Spiel 1","Sieger Spiel 3"]
[9,{"$f":"IF('Zwi.runde I'!G4>'Zwi.runde I'!H4,'Zwi.runde I'!B4,'Zwi.runde I'!C4)","v":"Erster A"},{"$f":"IF('Zwi.runde I'!G8>'Zwi.runde I'!H8,'Zwi.runde I'!B8,'Zwi.runde I'!C8)","v":"Erster C"},null,1,0,{"$f":"IF(E4>F4,2,IF(E4=F4,1,0))","v":2},{"$f":"IF(E4<F4,2,IF(E4=F4,1,0))","v":0},"14:15:00","A/1"]
[null,"Sieger Spiel 2","Sieger Spiel 4"]
[10,{"$f":"IF('Zwi.runde I'!G6>'Zwi.runde I'!H6,'Zwi.runde I'!B6,'Zwi.runde I'!C6)","v":"Erster B"},{"$f":"IF('Zwi.runde I'!G10>'Zwi.runde I'!H10,'Zwi.runde I'!B10,'Zwi.runde I'!C10)","v":"Erster D"},null,1,0,{"$f":"IF(E6>F6,2,IF(E6=F6,1,0))","v":2},{"$f":"IF(E6<F6,2,IF(E6=F6,1,0))","v":0},"14:15:00","A/2"]
[]
["Verlierer Überkreuz der Gruppenersten und Gruppenzweiten"]
["Spiel","Mannschaft 1","Mannschaft 2","Schiedsrichter","Bälle M1","Bälle M2","Punkte M1","Punkte M2","Zeit","Halle/Feld"]
[null,"Verlierer Spiel 1","Verlierer Spiel 3"]
[11,{"$f":"IF('Zwi.runde I'!G4<'Zwi.runde I'!H4,'Zwi.runde I'!B4,'Zwi.runde I'!C4)","v":"Zweiter B"},{"$f":"IF('Zwi.runde I'!G8<'Zwi.runde I'!H8,'Zwi.runde I'!B8,'Zwi.runde I'!C8)","v":"Zweiter D"},null,1,0,{"$f":"IF(E11>F11,2,IF(E11=F11,1,0))","v":2},{"$f":"IF(E11<F11,2,IF(E11=F11,1,0))","v":0},"14:45:00","A/1"]
[null,"Verlierer Spiel 2","Verlierer Spiel 4"]
[12,{"$f":"IF('Zwi.runde I'!G6<'Zwi.runde I'!H6,'Zwi.runde I'!B6,'Zwi.runde I'!C6)","v":"Zweiter A"},{"$f":"IF('Zwi.runde I'!G10<'Zwi.runde I'!H10,'Zwi.runde I'!B10,'Zwi.runde I'!C10)","v":"Zweiter C"},null,1,0,{"$f":"IF(E13>F13,2,IF(E13=F13,1,0))","v":2},{"$f":"IF(E13<F13,2,IF(E13=F13,1,0))","v":0},"14:45:00","A/2"]
[]
["Sieger Überkreuz der Gruppendritten und Gruppenvierten","Sieger Überkreuz der Gruppendritten und Gruppenvierten"]
["Spiel","Mannschaft 1","Mannschaft 2","Schiedsrichter","Bälle M1","Bälle M2","Punkte M1","Punkte M2","Zeit","Halle/Feld"]
[null,"Sieger Spiel 5","Sieger Spiel 7"]
[13,{"$f":"IF('Zwi.runde I'!G15>'Zwi.runde I'!H15,'Zwi.runde I'!B15,'Zwi.runde I'!C15)","v":"Dritter A"},{"$f":"IF('Zwi.runde I'!G19>'Zwi.runde I'!H19,'Zwi.runde I'!B19,'Zwi.runde I'!C19)","v":"Dritter C"},null,1,0,{"$f":"IF(E18>F18,2,IF(E18=F18,1,0))","v":2},{"$f":"IF(E18<F18,2,IF(E18=F18,1,0))","v":0},"14:15:00","B/1"]
[null,"Sieger Spiel 6","Sieger Spiel 8"]
[14,{"$f":"IF('Zwi.runde I'!G17>'Zwi.runde I'!H17,'Zwi.runde I'!B17,'Zwi.runde I'!C17)","v":"Dritter B"},{"$f":"IF('Zwi.runde I'!G21>'Zwi.runde I'!H21,'Zwi.runde I'!B21,'Zwi.runde I'!C21)","v":"Dritter D"},null,1,0,{"$f":"IF(E20>F20,2,IF(E20=F20,1,0))","v":2},{"$f":"IF(E20<F20,2,IF(E20=F20,1,0))","v":0},"14:15:00","B/2"]
[]
["Verlierer Überkreuz der Gruppendritten und Gruppenvierten"]
["Spiel","Mannschaft 1","Mannschaft 2","Schiedsrichter","Bälle M1","Bälle M2","Punkte M1","Punkte M2","Zeit","Halle/Feld"]
[null,"Verlierer Spiel 5","Verlierer Spiel 7"]
[15,{"$f":"IF('Zwi.runde I'!G15<'Zwi.runde I'!H15,'Zwi.runde I'!B15,'Zwi.runde I'!C15)","v":"Vierter B"},{"$f":"IF('Zwi.runde I'!G19<'Zwi.runde I'!H19,'Zwi.runde I'!B19,'Zwi.runde I'!C19)","v":"Vierter D"},null,1,0,{"$f":"IF(E25>F25,2,IF(E25=F25,1,0))","v":2},{"$f":"IF(E25<F25,2,IF(E25=F25,1,0))","v":0},"14:45:00","B/1"]
[null,"Verlierer Spiel 6","Verlierer Spiel 8"]
[16,{"$f":"IF('Zwi.runde I'!G17<'Zwi.runde I'!H17,'Zwi.runde I'!B17,'Zwi.runde I'!C17)","v":"Vierter A"},{"$f":"IF('Zwi.runde I'!G21<'Zwi.runde I'!H21,'Zwi.runde I'!B21,'Zwi.runde I'!C21)","v":"Vierter C"},null,1,0,{"$f":"IF(E27>F27,2,IF(E27=F27,1,0))","v":2},{"$f":"IF(E27<F27,2,IF(E27=F27,1,0))","v":0},"14:45:00","B/2"]

{"sheet":"Finals","index":6,"n_rows":27,"n_cols":12,"rows_kept":27,"cut":false,"hidden":false,"merged":[[21,0,21,11],[14,0,14,11],[7,0,7,11],[0,0,0,11]]}
["Plätze 13-16"]
["Spiel\num\nPlatz","Mannschaft 1","Mannschaft 2","Schiedsrichter","Ball-\npunkte\nM1","Ball-\npunkte\nM2","Satz-\npunkte\nM1","Satz-\npunkte\nM2","Spiel-\npunkte\nM1","Spiel-\npunkte\nM2","Zeit","Halle/Feld"]
[null,"Sieger Spiel 15","Sieger Spiel 16"]
[13,{"$f":"IF('Zwi.runde II'!G25>'Zwi.runde II'!H25,'Zwi.runde II'!B25,'Zwi.runde II'!C25)","v":"Vierter B"},{"$f":"IF('Zwi.runde II'!G27>'Zwi.runde II'!H27,'Zwi.runde II'!B27,'Zwi.runde II'!C27)","v":"Vierter A"},null,null,null,1,0,{"$f":"IF(G4>H4,2,IF(G4=H4,1,0))","v":2},{"$f":"IF(G4<H4,2,IF(G4=H4,1,0))","v":0},null,"B/1"]
[null,"Verlierer Spiel 15","Verlierer Spiel 16"]
[15,{"$f":"IF('Zwi.runde II'!G25<'Zwi.runde II'!H25,'Zwi.runde II'!B25,'Zwi.runde II'!C25)","v":"Vierter D"},{"$f":"IF('Zwi.runde II'!G27<'Zwi.runde II'!H27,'Zwi.runde II'!B27,'Zwi.runde II'!C27)","v":"Vierter C"},null,null,null,1,0,{"$f":"IF(G6>H6,2,IF(G6=H6,1,0))","v":2},{"$f":"IF(G6<H6,2,IF(G6=H6,1,0))","v":0},null,"B/2"]
[]
["Plätze 9-12"]
["Spiel\num\nPlatz","Mannschaft 1","Mannschaft 2","Schiedsrichter","Ball-\npunkte\nM1","Ball-\npunkte\nM2","Satz-\npunkte\nM1","Satz-\npunkte\nM2","Spiel-\npunkte\nM1","Spiel-\npunkte\nM2","Zeit","Halle/Feld"]
[null,"Sieger Spiel 13","Sieger Spiel 14"]
[9,{"$f":"IF('Zwi.runde II'!G18>'Zwi.runde II'!H18,'Zwi.runde II'!B18,'Zwi.runde II'!C18)","v":"Dritter A"},{"$f":"IF('Zwi.runde II'!G20>'Zwi.runde II'!H20,'Zwi.runde II'!B20,'Zwi.runde II'!C20)","v":"Dritter B"},null,null,null,1,0,{"$f":"IF(G11>H11,2,IF(G11=H11,1,0))","v":2},{"$f":"IF(G11<H11,2,IF(G11=H11,1,0))","v":0},"15:15:00","B/1"]
[null,"Verlierer Spiel 13","Verlierer Spiel 14"]
[11,{"$f":"IF('Zwi.runde II'!G18<'Zwi.runde II'!H18,'Zwi.runde II'!B18,'Zwi.runde II'!C18)","v":"Dritter C"},{"$f":"IF('Zwi.runde II'!G20<'Zwi.runde II'!H20,'Zwi.runde II'!B20,'Zwi.runde II'!C20)","v":"Dritter D"},null,null,null,1,0,{"$f":"IF(G13>H13,2,IF(G13=H13,1,0))","v":2},{"$f":"IF(G13<H13,2,IF(G13=H13,1,0))","v":0},"15:15:00","B/2"]
[]
["Plätze 5-8"]
["Spiel\num\nPlatz","Mannschaft 1","Mannschaft 2","Schiedsrichter","Ball-\npunkte\nM1","Ball-\npunkte\nM2","Satz-\npunkte\nM1","Satz-\npunkte\nM2","Spiel-\npunkte\nM1","Spiel-\npunkte\nM2","Zeit","Halle/Feld"]
[null,"Sieger Spiel 11","Sieger Spiel 12"]
[5,{"$f":"IF('Zwi.runde II'!G11>'Zwi.runde II'!H11,'Zwi.runde II'!B11,'Zwi.runde II'!C11)","v":"Zweiter B"},{"$f":"IF('Zwi.runde II'!G13>'Zwi.runde II'!H13,'Zwi.runde II'!B13,'Zwi.runde II'!C13)","v":"Zweiter A"},null,null,null,1,0,{"$f":"IF(G18>H18,2,IF(G18=H18,1,0))","v":2},{"$f":"IF(G18<H18,2,IF(G18=H18,1,0))","v":0},"15:15:00","A/1"]
[null,"Verlierer Spiel 11","Verlierer Spiel 12"]
[7,{"$f":"IF('Zwi.runde II'!G11<'Zwi.runde II'!H11,'Zwi.runde II'!B11,'Zwi.runde II'!C11)","v":"Zweiter D"},{"$f":"IF('Zwi.runde II'!G13<'Zwi.runde II'!H13,'Zwi.runde II'!B13,'Zwi.runde II'!C13)","v":"Zweiter C"},null,null,null,1,0,{"$f":"IF(G20>H20,2,IF(G20=H20,1,0))","v":2},{"$f":"IF(G20<H20,2,IF(G20=H20,1,0))","v":0},"15:15:00","A/2"]
[]
["Plätze 1-4"]
["Spiel\num\nPlatz","Mannschaft 1","Mannschaft 2","Schiedsrichter","Ball-\npunkte\nM1","Ball-\npunkte\nM2","Satz-\npunkte\nM1","Satz-\npunkte\nM2","Spiel-\npunkte\nM1","Spiel-\npunkte\nM2","Zeit","Halle/Feld"]
[null,"Sieger Spiel 9","Sieger Spiel 10"]
[1,{"$f":"IF('Zwi.runde II'!G4>'Zwi.runde II'!H4,'Zwi.runde II'!B4,'Zwi.runde II'!C4)","v":"Erster A"},{"$f":"IF('Zwi.runde II'!G6>'Zwi.runde II'!H6,'Zwi.runde II'!B6,'Zwi.runde II'!C6)","v":"Erster B"},null,null,null,1,0,{"$f":"IF(G25>H25,2,IF(G25=H25,1,0))","v":2},{"$f":"IF(G25<H25,2,IF(G25=H25,1,0))","v":0},null,"A/1"]
[null,"Verlierer Spiel 9","Verlierer Spiel 10"]
[3,{"$f":"IF('Zwi.runde II'!G4<'Zwi.runde II'!H4,'Zwi.runde II'!B4,'Zwi.runde II'!C4)","v":"Erster C"},{"$f":"IF('Zwi.runde II'!G6<'Zwi.runde II'!H6,'Zwi.runde II'!B6,'Zwi.runde II'!C6)","v":"Erster D"},null,null,null,1,0,{"$f":"IF(G27>H27,2,IF(G27=H27,1,0))","v":2},{"$f":"IF(G27<H27,2,IF(G27=H27,1,0))","v":0},null,"A/2"]

{"sheet":"Endstand","index":7,"n_rows":18,"n_cols":2,"rows_kept":18,"cut":false,"hidden":false,"merged":[[0,0,0,1]]}
["Endstand Turnier 2000"]
["Platz","Mannschaft"]
[1,{"$f":"IF(Finals!I25>Finals!J25,Finals!B25,Finals!C25)","v":"Erster A"}]
[2,{"$f":"IF(Finals!I25<Finals!J25,Finals!B25,Finals!C25)","v":"Erster B"}]
[3,{"$f":"IF(Finals!I27>Finals!J27,Finals!B27,Finals!C27)","v":"Erster C"}]
[4,{"$f":"IF(Finals!I27<Finals!J27,Finals!B27,Finals!C27)","v":"Erster D"}]
[5,{"$f":"IF(Finals!I18>Finals!J18,Finals!B18,Finals!C18)","v":"Zweiter B"}]
[6,{"$f":"IF(Finals!I18<Finals!J18,Finals!B18,Finals!C18)","v":"Zweiter A"}]
[7,{"$f":"IF(Finals!I20>Finals!J20,Finals!B20,Finals!C20)","v":"Zweiter D"}]
[8,{"$f":"IF(Finals!I20<Finals!J20,Finals!B20,Finals!C20)","v":"Zweiter C"}]
[9,{"$f":"IF(Finals!I11>Finals!J11,Finals!B11,Finals!C11)","v":"Dritter A"}]
[10,{"$f":"IF(Finals!I11<Finals!J11,Finals!B11,Finals!C11)","v":"Dritter B"}]
[11,{"$f":"IF(Finals!I13>Finals!J13,Finals!B13,Finals!C13)","v":"Dritter C"}]
[12,{"$f":"IF(Finals!I13<Finals!J13,Finals!B13,Finals!C13)","v":"Dritter D"}]
[13,{"$f":"IF(Finals!I4>Finals!J4,Finals!B4,Finals!C4)","v":"Vierter B"}]
[14,{"$f":"IF(Finals!I4<Finals!J4,Finals!B4,Finals!C4)","v":"Vierter A"}]
[15,{"$f":"IF(Finals!I6>Finals!J6,Finals!B6,Finals!C6)","v":"Vierter D"}]
[16,{"$f":"IF(Finals!I6<Finals!J6,Finals!B6,Finals!C6)","v":"Vierter C"}]

{"sheet":"Modus","index":8,"n_rows":10,"n_cols":1,"rows_kept":10,"cut":false,"hidden":false,"merged":[]}
["Es stehen 4 Spielfelder zur Verfügung und 16 Mannschaften nehmen am Turnier teil."]
[]
["Vorrunde: 4 Gruppen zu 4 Mannschaften - jeder gegen jeden"]
["Zwischenrunde 1: Überkreuz der Gruppenersten/-zweiten, Gruppendritten/-vierten."]
["Zwischenrunde 2: Sieger gg. Sieger, Verlierer gg. Verlierer der Zwischenrunde 1 "]
["Endrunde: Die Sieger der Zwischenrunde 2 spielen um die Plätze 1, 5, 9, 13 - die Verlierer um die Plätze 3, 7, 11 und 15."]
[]
["Achtung:"]
["Nur gelb Markierte Felder sind für Eingaben vorgesehen."]
["Eingaben in andere Felder zerstören mit großer Sicherheit Auswertungsfunktionen."]