{"text_format":"2","workbook":"xlsx","n_sheets":6,"sheets":["Gruppe A","Gruppe B","Überkreuz","Platzierung","Endergebnis","Modus"],"not_rendered":{"charts":0,"images":2,"macros":1,"external_links":0,"defined_names":0,"comments":0,"pivot_tables":0},"unopened":[],"bounds":{"document_bytes":16777216,"sheet_cells":100000,"run_cost":"one","rows_first":2000,"rows_last":500,"rows_between":2000,"halvings":0,"cell_chars":16384,"cell_head_chars":4096},"cells_cut":0,"cells_raw":0,"read":"whole","date_system":"1900"}

{"sheet":"Gruppe A","index":0,"n_rows":34,"n_cols":9,"rows_kept":34,"cut":false,"hidden":false,"merged":[[26,0,26,6],[4,0,4,1],[8,0,8,7],[0,0,0,1],[1,0,1,1],[2,0,2,1],[3,0,3,1],[5,0,5,1],[6,0,6,1]]}
["Mannschaften Gruppe A"]
["Erster A"]
["Zweiter A"]
["Dritter A",null,null,"Modus:"]
["Vierter A",null,null,"Spiel mit 12 Minuten Dauer."]
["Fünfter A"]
["Sechster A",null,null,"Mittagspause: 13:00 bis 13:30 Uhr"]
[]
["Spielplan Vorrunde"]
["Mannschaft 1","Mannschaft 2","Schiedsrichter","Bälle M1","Bälle M2","Punkte M1","Punkte M2","Zeit"]
[{"$f":"$A$2","v":"Erster A"},{"$f":"$A$3","v":"Zweiter A"},{"$f":"$A$7","v":"Sechster A"},0,0,{"$f":"IF(D11>E11,2,IF(D11=E11,1,0))","v":1},{"$f":"IF(D11<E11,2,IF(D11=E11,1,0))","v":1},"09:30:00"]
[{"$f":"$A$4","v":"Dritter A"},{"$f":"$A$5","v":"Vierter A"},{"$f":"$A$3","v":"Zweiter A"},0,0,{"$f":"IF(D12>E12,2,IF(D12=E12,1,0))","v":1},{"$f":"IF(D12<E12,2,IF(D12=E12,1,0))","v":1},{"$f":"H11+TIME(0,15,0)","v":"09:45:00"}]
[{"$f":"$A$6","v":"Fünfter A"},{"$f":"$A$7","v":"Sechster A"},{"$f":"$A$4","v":"Dritter A"},0,0,{"$f":"IF(D13>E13,2,IF(D13=E13,1,0))","v":1},{"$f":"IF(D13<E13,2,IF(D13=E13,1,0))","v":1},{"$f":"H12+TIME(0,15,0)","v":"10:00:00"}]
[{"$f":"$A$3","v":"Zweiter A"},{"$f":"$A$5","v":"Vierter A"},{"$f":"$A$6","v":"Fünfter A"},0,0,{"$f":"IF(D14>E14,2,IF(D14=E14,1,0))","v":1},{"$f":"IF(D14<E14,2,IF(D14=E14,1,0))","v":1},"10:15:00"]
[{"$f":"$A$2","v":"Erster A"},{"$f":"$A$7","v":"Sechster A"},{"$f":"$A$5","v":"Vierter A"},0,0,1,1,"10:30:00"]
[{"$f":"$A$4","v":"Dritter A"},{"$f":"$A$6","v":"Fünfter A"},{"$f":"$A$2","v":"Erster A"},0,0,1,1,"10:45:00"]
[{"$f":"$A$5","v":"Vierter A"},{"$f":"$A$7","v":"Sechster A"},{"$f":"$A$3","v":"Zweiter A"},0,0,1,1,"11:00:00"]
[{"$f":"$A$3","v":"Zweiter A"},{"$f":"$A$6","v":"Fünfter A"},{"$f":"$A$7","v":"Sechster A"},0,0,1,1,"11:15:00"]
[{"$f":"$A$2","v":"Erster A"},{"$f":"$A$4","v":"Dritter A"},{"$f":"$A$5","v":"Vierter A"},0,0,1,1,"11:30:00"]
[{"$f":"$A$5","v":"Vierter A"},{"$f":"$A$6","v":"Fünfter A"},{"$f":"$A$3","v":"Zweiter A"},0,0,1,1,"11:45:00","x"]
[{"$f":"$A$7","v":"Sechster A"},{"$f":"$A$4","v":"Dritter A"},{"$f":"$A$2","v":"Erster A"},0,0,1,1,"12:00:00"]
[{"$f":"$A$3","v":"Zweiter A"},{"$f":"$A$7","v":"Sechster A"},{"$f":"$A$6","v":"Fünfter A"},0,0,1,1,"12:15:00"]
[{"$f":"$A$6","v":"Fünfter A"},{"$f":"$A$2","v":"Erster A"},{"$f":"$A$5","v":"Vierter A"},0,0,{"$f":"IF(D23>E23,2,IF(D23=E23,1,0))","v":1},{"$f":"IF(D23<E23,2,IF(D23=E23,1,0))","v":1},"12:30:00"]
[{"$f":"$A$5","v":"Vierter A"},{"$f":"$A$2","v":"Erster A"},{"$f":"$A$4","v":"Dritter A"},0,0,{"$f":"IF(D24>E24,2,IF(D24=E24,1,0))","v":1},{"$f":"IF(D24<E24,2,IF(D24=E24,1,0))","v":1},"12:45:00"]
[{"$f":"$A$4","v":"Dritter A"},{"$f":"$A$3","v":"Zweiter A"},{"$f":"$A$7","v":"Sechster A"},0,0,{"$f":"IF(D25>E25,2,IF(D25=E25,1,0))","v":1},{"$f":"IF(D25<E25,2,IF(D25=E25,1,0))","v":1},"13:00:00"]
[]
["Tabelle"]
["Mannschaft","Bälle gewonnen","Bälle verloren","Punkte gew.","Punkte verl.","Balldifferenz","Punktediff."]
[{"$f":"$A$2","v":"Erster A"},{"$f":"$D$11+$D$15+$D$19+$E$23+$E$24","v":0},{"$f":"$E$11+$E$15+$E$19+$D$23+$D$24","v":0},{"$f":"$F$11+$F$15+$F$19+$G$23+$G$24","v":5},{"$f":"$G$11+$G$15+$G$19+$F$23+$F$24","v":5},{"$f":"B29-C29","v":0},{"$f":"D29-E29","v":0}]
[{"$f":"$A$3","v":"Zweiter A"},{"$f":"$E$11+$D$14+$D$18+$D$22+$E$25","v":0},{"$f":"$D$11+$E$14+$E$18+$E$22+$D$25","v":0},{"$f":"$G$11+$F$14+$F$18+$F$22+$G$25","v":5},{"$f":"$F$11+$G$14+$G$18+$G$22+$F$25","v":5},0,0]
[{"$f":"$A$4","v":"Dritter A"},{"$f":"$D$12+$D$16+$E$19+$E$21+$D$25","v":0},{"$f":"$E$12+$E$16+$D$19+$D$21+$E$25","v":0},{"$f":"$F$12+$F$16+$G$19+$G$21+$F$25","v":5},{"$f":"$G$12+$G$16+$F$19+$F$21+$G$25","v":5},0,0]
[{"$f":"$A$5","v":"Vierter A"},{"$f":"$E$12+$E$14+$D$17+$D$20+$D$24","v":0},{"$f":"$D$12+$D$14+$E$17+$E$20+$E$24","v":0},{"$f":"$G$12+$G$14+$F$17+$F$20+$F$24","v":5},{"$f":"$F$12+$F$14+$G$17+$G$20+$G$24","v":5},0,0]
[{"$f":"$A$6","v":"Fünfter A"},{"$f":"$D$13+$E$16+$E$18+$E$20+$D$23","v":0},{"$f":"$E$13+$D$16+$D$18+$D$20+$E$23","v":0},{"$f":"$F$13+$G$16+$G$18+$G$20+$F$23","v":5},{"$f":"$G$13+$F$16+$F$18+$F$20+$G$23","v":5},0,0]
[{"$f":"$A$7","v":"Sechster A"},{"$f":"$E$13+$E$15+$E$17+$D$21+$E$22","v":0},{"$f":"$D$13+$D$15+$D$17+$E$21+$D$22","v":0},{"$f":"$G$13+$G$15+$G$17+$F$21+$G$22","v":5},{"$f":"$F$13+$F$15+$F$17+$G$21+$F$22","v":5},0,0]

{"sheet":"Gruppe B","index":1,"n_rows":34,"n_cols":9,"rows_kept":34,"cut":false,"hidden":false,"merged":[[26,0,26,6],[4,0,4,1],[8,0,8,7],[0,0,0,1],[1,0,1,1],[2,0,2,1],[3,0,3,1],[5,0,5,1],[6,0,6,1]]}
["Mannschaften Gruppe B"]
["Erster B"]
["Zweiter B"]
["Dritter B",null,null,"Modus:"]
["Vierter B",null,null,"Spiel mit 12 Minuten Dauer."]
["Fünfter B"]
["Sechster B",null,null,"Mittagspause: 13:00 bis 13:30 Uhr"]
[]
["Spielplan Vorrunde"]
["Mannschaft 1","Mannschaft 2","Schiedsrichter","Bälle M1","Bälle M2","Punkte M1","Punkte M2","Zeit"]
[{"$f":"$A$2","v":"Erster B"},{"$f":"$A$3","v":"Zweiter B"},{"$f":"$A$7","v":"Sechster B"},0,0,{"$f":"IF(D11>E11,2,IF(D11=E11,1,0))","v":1},{"$f":"IF(D11<E11,2,IF(D11=E11,1,0))","v":1},"09:30:00"]
[{"$f":"$A$4","v":"Dritter B"},{"$f":"$A$5","v":"Vierter B"},{"$f":"$A$3","v":"Zweiter B"},0,0,1,1,{"$f":"H11+TIME(0,15,0)","v":"09:45:00"}]
[{"$f":"$A$6","v":"Fünfter B"},{"$f":"$A$7","v":"Sechster B"},{"$f":"$A$4","v":"Dritter B"},0,0,1,1,"10:00:00"]
[{"$f":"$A$3","v":"Zweiter B"},{"$f":"$A$5","v":"Vierter B"},{"$f":"$A$6","v":"Fünfter B"},0,0,1,1,"10:15:00"]
[{"$f":"$A$2","v":"Erster B"},{"$f":"$A$7","v":"Sechster B"},{"$f":"$A$5","v":"Vierter B"},0,0,1,1,"10:30:00"]
[{"$f":"$A$4","v":"Dritter B"},{"$f":"$A$6","v":"Fünfter B"},{"$f":"$A$2","v":"Erster B"},0,0,1,1,"10:45:00"]
[{"$f":"$A$5","v":"Vierter B"},{"$f":"$A$7","v":"Sechster B"},{"$f":"$A$3","v":"Zweiter B"},0,0,1,1,"11:00:00"]
[{"$f":"$A$3","v":"Zweiter B"},{"$f":"$A$6","v":"Fünfter B"},{"$f":"$A$7","v":"Sechster B"},0,0,1,1,"11:15:00"]
[{"$f":"$A$2","v":"Erster B"},{"$f":"$A$4","v":"Dritter B"},{"$f":"$A$5","v":"Vierter B"},0,0,1,1,"11:30:00"]
[{"$f":"$A$5","v":"Vierter B"},{"$f":"$A$6","v":"Fünfter B"},{"$f":"$A$3","v":"Zweiter B"},0,0,1,1,"11:45:00","x"]
[{"$f":"$A$7","v":"Sechster B"},{"$f":"$A$4","v":"Dritter B"},{"$f":"$A$2","v":"Erster B"},0,0,1,1,"12:00:00"]
[{"$f":"$A$3","v":"Zweiter B"},{"$f":"$A$7","v":"Sechster B"},{"$f":"$A$6","v":"Fünfter B"},0,0,1,1,"12:15:00"]
[{"$f":"$A$6","v":"Fünfter B"},{"$f":"$A$2","v":"Erster B"},{"$f":"$A$5","v":"Vierter B"},0,0,1,1,"12:30:00"]
[{"$f":"$A$5","v":"Vierter B"},{"$f":"$A$2","v":"Erster B"},{"$f":"$A$4","v":"Dritter B"},0,0,1,1,"12:45:00"]
[{"$f":"$A$4","v":"Dritter B"},{"$f":"$A$3","v":"Zweiter B"},{"$f":"$A$7","v":"Sechster B"},0,0,1,1,"13:00:00"]
[]
["Tabelle"]
["Mannschaft","Bälle gewonnen","Bälle verloren","Punkte gew.","Punkte verl.","Balldifferenz","Punktediff."]
[{"$f":"$A$2","v":"Erster B"},{"$f":"$D$11+$D$15+$D$19+$E$23+$E$24","v":0},{"$f":"$E$11+$E$15+$E$19+$D$23+$D$24","v":0},{"$f":"$F$11+$F$15+$F$19+$G$23+$G$24","v":5},{"$f":"$G$11+$G$15+$G$19+$F$23+$F$24","v":5},{"$f":"B29-C29","v":0},{"$f":"D29-E29","v":0}]
[{"$f":"$A$3","v":"Zweiter B"},{"$f":"$E$11+$D$14+$D$18+$D$22+$E$25","v":0},{"$f":"$D$11+$E$14+$E$18+$E$22+$D$25","v":0},{"$f":"$G$11+$F$14+$F$18+$F$22+$G$25","v":5},{"$f":"$F$11+$G$14+$G$18+$G$22+$F$25","v":5},0,0]
[{"$f":"$A$4","v":"Dritter B"},{"$f":"$D$12+$D$16+$E$19+$E$21+$D$25","v":0},{"$f":"$E$12+$E$16+$D$19+$D$21+$E$25","v":0},{"$f":"$F$12+$F$16+$G$19+$G$21+$F$25","v":5},{"$f":"$G$12+$G$16+$F$19+$F$21+$G$25","v":5},0,0]
[{"$f":"$A$5","v":"Vierter B"},{"$f":"$E$12+$E$14+$D$17+$D$20+$D$24","v":0},{"$f":"$D$12+$D$14+$E$17+$E$20+$E$24","v":0},{"$f":"$G$12+$G$14+$F$17+$F$20+$F$24","v":5},{"$f":"$F$12+$F$14+$G$17+$G$20+$G$24","v":5},0,0]
[{"$f":"$A$6","v":"Fünfter B"},{"$f":"$D$13+$E$16+$E$18+$E$20+$D$23","v":0},{"$f":"$E$13+$D$16+$D$18+$D$20+$E$23","v":0},{"$f":"$F$13+$G$16+$G$18+$G$20+$F$23","v":5},{"$f":"$G$13+$F$16+$F$18+$F$20+$G$23","v":5},0,0]
[{"$f":"$A$7","v":"Sechster B"},{"$f":"$E$13+$E$15+$E$17+$D$21+$E$22","v":0},{"$f":"$D$13+$D$15+$D$17+$E$21+$D$22","v":0},{"$f":"$G$13+$G$15+$G$17+$F$21+$G$22","v":5},{"$f":"$F$13+$F$15+$F$17+$G$21+$F$22","v":5},0,0]

{"sheet":"Überkreuz","index":2,"n_rows":17,"n_cols":10,"rows_kept":17,"cut":false,"hidden":false,"merged":[[0,0,0,9]]}
["Überkreuzspiele"]
["Spiel","Mannschaft 1","Mannschaft 2","Schiedsrichter","Bälle M1","Bälle M2","Punkte M1","Punkte M2","Zeit","Feld"]
[]
[null,"Erster Gruppe A","Zweiter Gruppe B","Dritter Gruppe B"]
[1,{"$f":"'Gruppe A'!A29","v":"Erster A"},{"$f":"'Gruppe B'!A30","v":"Zweiter B"},{"$f":"'Gruppe B'!A31","v":"Dritter B"},1,0,{"$f":"IF(E5>F5,2,IF(E5=F5,1,0))","v":2},{"$f":"IF(E5<F5,2,IF(E5=F5,1,0))","v":0},"13:30:00","A"]
[null,"Erster Gruppe B","Zweiter Gruppe A","Dritter Gruppe A"]
[2,{"$f":"'Gruppe B'!A29","v":"Erster B"},{"$f":"'Gruppe A'!A30","v":"Zweiter A"},{"$f":"'Gruppe A'!A31","v":"Dritter A"},1,0,{"$f":"IF(E7>F7,2,IF(E7=F7,1,0))","v":2},{"$f":"IF(E7<F7,2,IF(E7=F7,1,0))","v":0},"13:30:00","B"]
[null,"Dritter Gruppe A","Vierter Gruppe B","Zweiter Gruppe B"]
[3,{"$f":"'Gruppe A'!A31","v":"Dritter A"},{"$f":"'Gruppe B'!A32","v":"Vierter B"},{"$f":"'Gruppe B'!A30","v":"Zweiter B"},1,0,{"$f":"IF(E9>F9,2,IF(E9=F9,1,0))","v":2},{"$f":"IF(E9<F9,2,IF(E9=F9,1,0))","v":0},{"$f":"I7+TIME(0,30,0)","v":"14:00:00"},"A"]
[null,"Dritter Gruppe B","Vierter Gruppe A","Zweiter Gruppe A"]
[4,{"$f":"'Gruppe B'!A31","v":"Dritter B"},{"$f":"'Gruppe A'!A32","v":"Vierter A"},{"$f":"'Gruppe A'!A30","v":"Zweiter A"},1,0,{"$f":"IF(E11>F11,2,IF(E11=F11,1,0))","v":2},{"$f":"IF(E11<F11,2,IF(E11=F11,1,0))","v":0},{"$f":"I7+TIME(0,30,0)","v":"14:00:00"},"B"]
[null,"Fünfter Gruppe A","Sechster Gruppe B","Erster Gruppe B"]
[5,{"$f":"'Gruppe A'!A33","v":"Fünfter A"},{"$f":"'Gruppe B'!A34","v":"Sechster B"},{"$f":"'Gruppe B'!A29","v":"Erster B"},1,0,{"$f":"IF(E13>F13,2,IF(E13=F13,1,0))","v":2},{"$f":"IF(E13<F13,2,IF(E13=F13,1,0))","v":0},{"$f":"I11+TIME(0,30,0)","v":"14:30:00"},"A"]
[null,"Fünfter Gruppe B","Sechster Gruppe A","Erster Gruppe A"]
[6,{"$f":"'Gruppe B'!A33","v":"Fünfter B"},{"$f":"'Gruppe A'!A34","v":"Sechster A"},{"$f":"'Gruppe A'!A29","v":"Erster A"},1,0,{"$f":"IF(E15>F15,2,IF(E15=F15,1,0))","v":2},{"$f":"IF(E15<F15,2,IF(E15=F15,1,0))","v":0},{"$f":"I11+TIME(0,30,0)","v":"14:30:00"},"B"]
[]
["Modus: 2 x 12 Minuten, dazwischen 1 Minute für Seitenwechsel = 25 Minuten"]

{"sheet":"Platzierung","index":3,"n_rows":26,"n_cols":12,"rows_kept":26,"cut":false,"hidden":false,"merged":[[0,0,0,11],[8,0,8,11],[16,0,16,11]]}
["Plätze 9-12"]
["Spiel\num\nPlatz","Mannschaft 1","Mannschaft 2","Schiedsrichter","Ball-\npunkte\nM1","Ball-\npunkte\nM2","Satz-\npunkte\nM1","Satz-\npunkte\nM2","Spiel-\npunkte\nM1","Spiel-\npunkte\nM2","Zeit","Feld"]
[]
[null,"Sieger Spiel 5","Sieger Spiel 6","Sieger Spiel 2"]
[9,{"$f":"IF(Überkreuz!G13>Überkreuz!H13,Überkreuz!B13,Überkreuz!C13)","v":"Fünfter A"},{"$f":"IF(Überkreuz!G15>Überkreuz!H15,Überkreuz!B15,Überkreuz!C15)","v":"Fünfter B"},{"$f":"IF(Überkreuz!G7>Überkreuz!H7,Überkreuz!B7,Überkreuz!C7)","v":"Erster B"},0,0,1,0,{"$f":"IF(G5>H5,2,IF(G5=H5,1,0))","v":2},{"$f":"IF(G5<H5,2,IF(G5=H5,1,0))","v":0},"15:00:00","A"]
[null,"Verlierer Spiel 5","Verlierer Spiel 6","Verlierer Spiel 2"]
[11,{"$f":"IF(Überkreuz!G13<Überkreuz!H13,Überkreuz!B13,Überkreuz!C13)","v":"Sechster B"},{"$f":"IF(Überkreuz!G15<Überkreuz!H15,Überkreuz!B15,Überkreuz!C15)","v":"Sechster A"},{"$f":"IF(Überkreuz!G7<Überkreuz!H7,Überkreuz!B7,Überkreuz!C7)","v":"Zweiter A"},0,0,1,0,{"$f":"IF(G7>H7,2,IF(G7=H7,1,0))","v":2},{"$f":"IF(G7<H7,2,IF(G7=H7,1,0))","v":0},"15:00:00","B"]
[]
["Plätze 5-8"]
["Spiel\num\nPlatz","Mannschaft 1","Mannschaft 2","Schiedsrichter","Ball-\npunkte\nM1","Ball-\npunkte\nM2","Satz-\npunkte\nM1","Satz-\npunkte\nM2","Spiel-\npunkte\nM1","Spiel-\npunkte\nM2","Zeit","Feld"]
[]
[null,"Sieger Spiel 3","Sieger Spiel 4","Sieger Spiel 1"]
[5,{"$f":"IF(Überkreuz!G9>Überkreuz!H9,Überkreuz!B9,Überkreuz!C9)","v":"Dritter A"},{"$f":"IF(Überkreuz!G11>Überkreuz!H11,Überkreuz!B11,Überkreuz!C11)","v":"Dritter B"},{"$f":"IF(Überkreuz!G5>Überkreuz!H5,Überkreuz!B5,Überkreuz!C5)","v":"Erster A"},0,0,1,0,{"$f":"IF(G13>H13,2,IF(G13=H13,1,0))","v":2},{"$f":"IF(G13<H13,2,IF(G13=H13,1,0))","v":0},"15:30:00","A"]
[null,"Verlierer Spiel 3","Verlierer Spiel 4","Verlierer Spiel 1"]
[7,{"$f":"IF(Überkreuz!G9<Überkreuz!H9,Überkreuz!B9,Überkreuz!C9)","v":"Vierter B"},{"$f":"IF(Überkreuz!G11<Überkreuz!H11,Überkreuz!B11,Überkreuz!C11)","v":"Vierter A"},{"$f":"IF(Überkreuz!G5<Überkreuz!H5,Überkreuz!B5,Überkreuz!C5)","v":"Zweiter B"},0,0,1,0,{"$f":"IF(G15>H15,2,IF(G15=H15,1,0))","v":2},{"$f":"IF(G15<H15,2,IF(G15=H15,1,0))","v":0},"15:30:00","B"]
[]
["Plätze 1-4"]
["Spiel\num\nPlatz","Mannschaft 1","Mannschaft 2","Schiedsrichter","Ball-\npunkte\nM1","Ball-\npunkte\nM2","Satz-\npunkte\nM1","Satz-\npunkte\nM2","Spiel-\npunkte\nM1","Spiel-\npunkte\nM2","Zeit","Feld"]
[]
[null,"Sieger Spiel 1","Sieger Spiel 2","Sieger Spiel 3"]
[1,{"$f":"IF(Überkreuz!G5>Überkreuz!H5,Überkreuz!B5,Überkreuz!C5)","v":"Erster A"},{"$f":"IF(Überkreuz!G7>Überkreuz!H7,Überkreuz!B7,Überkreuz!C7)","v":"Erster B"},{"$f":"IF(Überkreuz!G9>Überkreuz!H9,Überkreuz!B9,Überkreuz!C9)","v":"Dritter A"},0,0,1,0,{"$f":"IF(G21>H21,2,IF(G21=H21,1,0))","v":2},{"$f":"IF(G21<H21,2,IF(G21=H21,1,0))","v":0},"16:00:00","A"]
[null,"Verlierer Spiel 1","Verlierer Spiel 2","Verlierer Spiel 3"]
[3,{"$f":"IF(Überkreuz!G5<Überkreuz!H5,Überkreuz!B5,Überkreuz!C5)","v":"Zweiter B"},{"$f":"IF(Überkreuz!G7<Überkreuz!H7,Überkreuz!B7,Überkreuz!C7)","v":"Zweiter A"},{"$f":"IF(Überkreuz!G9<Überkreuz!H9,Überkreuz!B9,Überkreuz!C9)","v":"Vierter B"},0,0,1,0,{"$f":"IF(G23>H23,2,IF(G23=H23,1,0))","v":2},{"$f":"IF(G23<H23,2,IF(G23=H23,1,0))","v":0},"16:00:00","B"]
[]
[]
["Modus: 2 Gewinnsätze à 25 Punkte, ggf. entscheidender 3. Satz im Tie-Break (15 Punkte)"]

{"sheet":"Endergebnis","index":4,"n_rows":14,"n_cols":2,"rows_kept":14,"cut":false,"hidden":false,"merged":[[0,0,0,1]]}
["Endergebnis"]
["Platz","Mannschaft"]
[1,{"$f":"IF(Platzierung!I21>Platzierung!J21,Platzierung!B21,Platzierung!C21)","v":"Erster A"}]
[2,{"$f":"IF(Platzierung!I21<Platzierung!J21,Platzierung!B21,Platzierung!C21)","v":"Erster B"}]
[3,{"$f":"IF(Platzierung!I23>Platzierung!J23,Platzierung!B23,Platzierung!C23)","v":"Zweiter B"}]
[4,{"$f":"IF(Platzierung!I23<Platzierung!J23,Platzierung!B23,Platzierung!C23)","v":"Zweiter A"}]
[5,{"$f":"IF(Platzierung!I13>Platzierung!J13,Platzierung!B13,Platzierung!C13)","v":"Dritter A"}]
[6,{"$f":"IF(Platzierung!I13<Platzierung!J13,Platzierung!B13,Platzierung!C13)","v":"Dritter B"}]
[7,{"$f":"IF(Platzierung!I15>Platzierung!J15,Platzierung!B15,Platzierung!C15)","v":"Vierter B"}]
[8,{"$f":"IF(Platzierung!I15<Platzierung!J15,Platzierung!B15,Platzierung!C15)","v":"Vierter A"}]
[9,{"$f":"IF(Platzierung!I5>Platzierung!J5,Platzierung!B5,Platzierung!C5)","v":"Fünfter A"}]
[10,{"$f":"IF(Platzierung!I5<Platzierung!J5,Platzierung!B5,Platzierung!C5)","v":"Fünfter B"}]
[11,{"$f":"IF(Platzierung!I7>Platzierung!J7,Platzierung!B7,Platzierung!C7)","v":"Sechster B"}]
[12,{"$f":"IF(Platzierung!I7<Platzierung!J7,Platzierung!B7,Platzierung!C7)","v":"Sechster A"}]

{"sheet":"Modus","index":5,"n_rows":9,"n_cols":1,"rows_kept":9,"cut":false,"hidden":false,"merged":[]}
["Es stehen 2 Spielfelder zur Verfügung und 12 Mannschaften nehmen am Turnier teil."]
[]
["Vorrunde: 2 Gruppen zu 6 Mannschaften - jeder gegen jeden"]
["Zwischenrunde: Überkreuz der Gruppenersten/-zweiten, Gruppendritten/-vierten, usw."]
["Endrunde: Die Sieger der Zwischenrunde spielen um die Plätze 1, 5, 9 - die Verlierer um die Plätze 3, 7 und 11."]
[]
["Achtung:"]
["Nur gelb Markierte Felder sind für Eingaben vorgesehen."]
["Eingaben in andere Felder zerstören mit großer Sicherheit Auswertungsfunktionen."]